{"text_format":"1","workbook":"xlsx","n_sheets":2,"sheets":["LETs","Metas"],"not_rendered":{"charts":0,"images":0,"macros":1,"external_links":1,"defined_names":3,"comments":1,"pivot_tables":0},"unopened":[],"bounds":{"document_bytes":16777216,"sheet_cells":100000,"rows_first":2000,"rows_last":500,"rows_between":2000,"halvings":0,"cell_chars":16384,"cell_head_chars":4096},"cells_cut":0,"cells_raw":0,"read":"whole","date_system":"1900"}

{"sheet":"LETs","index":0,"n_rows":214,"n_cols":24,"rows_kept":214,"cut":false,"hidden":false,"merged":[[27,26,73,35],[52,1,77,1],[120,2,129,2],[108,2,111,2],[92,2,96,2],[51,0,146,0],[51,2,60,2],[65,2,69,2],[143,2,146,2],[143,4,146,4],[134,2,138,2],[121,1,146,1],[79,1,119,1],[132,2,133,2],[132,4,133,4],[134,4,138,4],[139,2,142,2],[139,4,142,4],[116,2,119,2],[116,4,119,4],[120,4,125,4],[130,2,131,2],[130,4,131,4],[105,2,107,2],[105,4,107,4],[108,4,111,4],[112,2,115,2],[112,4,115,4],[51,4,58,4],[61,2,62,2],[61,4,62,4],[63,2,64,2],[63,4,64,4],[65,4,69,4],[101,2,104,2],[101,4,104,4],[70,2,73,2],[70,4,73,4],[74,2,77,2],[74,4,77,4],[78,2,87,2],[92,4,96,4],[97,2,100,2],[97,4,100,4],[42,1,44,1],[42,2,44,2],[42,4,44,4],[45,1,50,1],[45,2,48,2],[45,4,48,4],[49,2,50,2],[49,4,50,4],[78,4,83,4],[88,2,89,2],[88,4,89,4],[90,2,91,2],[90,4,91,4],[21,4,24,4],[25,2,27,2],[25,4,27,4],[28,1,41,1],[28,2,37,2],[28,4,37,4],[38,2,41,2],[38,4,39,4],[40,4,41,4],[1,0,1,2],[2,0,50,0],[2,1,5,1],[2,2,5,2],[2,4,5,4],[6,1,14,1],[6,2,10,2],[6,4,10,4],[11,2,12,2],[11,4,12,4],[13,2,14,2],[13,4,14,4],[15,1,27,1],[15,2,20,2],[15,4,20,4],[21,2,24,2],[147,0,213,1],[147,2,156,2],[159,2,160,2],[161,2,165,2],[166,2,190,2],[191,2,213,2],[157,2,158,2]]}
["CD","Copa","2021-02-10","Gerot_Let´s - Revenda_Seropédica","P",2021,"2021-01-31","2021-02-28","2021-03-31","2021-04-30","2021-05-31","2021-06-30","2021-07-31","2021-08-31","2021-09-30","2021-10-31","2021-11-30","2021-12-31"]
["Seropédica",null,null,"Indicadores / Parâmetros",{"$f":"[1]LETs!E2","v":8},{"$f":"[1]LETs!F2","v":2021},{"$f":"[1]LETs!G2","v":"Jan/21"},{"$f":"[1]LETs!H2","v":"Fev/21"},{"$f":"[1]LETs!I2","v":"Mar/21"},{"$f":"[1]LETs!J2","v":"Abr/21"},{"$f":"[1]LETs!K2","v":"Mai/21"},{"$f":"[1]LETs!L2","v":"Jun/21"},{"$f":"[1]LETs!M2","v":"Jul/21"},{"$f":"[1]LETs!N2","v":"Ago/21"},{"$f":"[1]LETs!O2","v":"Set/21"},{"$f":"[1]LETs!P2","v":"Out/21"},{"$f":"[1]LETs!Q2","v":"Nov/21"},{"$f":"[1]LETs!R2","v":"Dez/21"},{"$f":"WORKDAY(TODAY(),-1,0)","v":"2021-02-10"}]
["SUPER COPA","Outbound","Performance - SEC","Performance - SEC",{"$f":"[1]LETs!E3","v":1},{"$f":"[1]LETs!F3","v":0.92390000000000005},{"$f":"[1]LETs!G3","v":0.90880000000000005},{"$f":"[1]LETs!H3","v":0.96719999999999995},{"$f":"[1]LETs!I3","v":0},{"$f":"[1]LETs!J3","v":0},{"$f":"[1]LETs!K3","v":0},{"$f":"[1]LETs!L3","v":0},{"$f":"[1]LETs!M3","v":0},{"$f":"[1]LETs!N3","v":0},{"$f":"[1]LETs!O3","v":0},{"$f":"[1]LETs!P3","v":0},{"$f":"[1]LETs!Q3","v":0},{"$f":"[1]LETs!R3","v":0},{"$f":"IFERROR(INDEX([1]LETs!$F$3:$AZZ$214,MATCH($D3,[1]LETs!$D$3:$D$214,0),MATCH($S$2,[1]LETs!$F$2:$AZZ$2,0)),0)","v":0.98829999999999996},null,null,"Para:","BRRJDL.COORDENADORES-SEROPEDICA <coordenadores.seropedica@b2wdigital.com>; BRRJDL.WAVE-SEROPEDICA <wave.seropedica@b2wdigital.com>; BRRJODL.PACKING-SEROP <packing.serop@b2wdigital.com>; BRRJDL.SUPERVISORES-SEROPEDICA <supervisores.seropedica@b2wdigital.com>; BRRJDL.RECEBIMENTO-SEROPEDICA <recebimento.seropedica@b2wdigital.com>; BRRJDL.PICK-SEROPEDICA <pick.seropedica@b2wdigital.com>"]
[null,null,null,"Prazo",null,{"$f":"[1]LETs!F4","v":330375},{"$f":"[1]LETs!G4","v":240822},{"$f":"[1]LETs!H4","v":89553},{"$f":"[1]LETs!I4","v":0},{"$f":"[1]LETs!J4","v":0},{"$f":"[1]LETs!K4","v":0},{"$f":"[1]LETs!L4","v":0},{"$f":"[1]LETs!M4","v":0},{"$f":"[1]LETs!N4","v":0},{"$f":"[1]LETs!O4","v":0},{"$f":"[1]LETs!P4","v":0},{"$f":"[1]LETs!Q4","v":0},{"$f":"[1]LETs!R4","v":0},{"$f":"IFERROR(INDEX([1]LETs!$F$3:$AZZ$214,MATCH($D4,[1]LETs!$D$3:$D$214,0),MATCH($S$2,[1]LETs!$F$2:$AZZ$2,0)),0)","v":11219}]
[null,null,null,"Atraso",null,{"$f":"[1]LETs!F5","v":27202},{"$f":"[1]LETs!G5","v":24169},{"$f":"[1]LETs!H5","v":3033},{"$f":"[1]LETs!I5","v":0},{"$f":"[1]LETs!J5","v":0},{"$f":"[1]LETs!K5","v":0},{"$f":"[1]LETs!L5","v":0},{"$f":"[1]LETs!M5","v":0},{"$f":"[1]LETs!N5","v":0},{"$f":"[1]LETs!O5","v":0},{"$f":"[1]LETs!P5","v":0},{"$f":"[1]LETs!Q5","v":0},{"$f":"[1]LETs!R5","v":0},{"$f":"IFERROR(INDEX([1]LETs!$F$3:$AZZ$214,MATCH($D5,[1]LETs!$D$3:$D$214,0),MATCH($S$2,[1]LETs!$F$2:$AZZ$2,0)),0)","v":133}]
[null,null,null,"Meta",null,{"$f":"[1]LETs!F6","v":0.98},{"$f":"[1]LETs!G6","v":0.98},{"$f":"[1]LETs!H6","v":0.98},{"$f":"[1]LETs!I6","v":0},{"$f":"[1]LETs!J6","v":0},{"$f":"[1]LETs!K6","v":0},{"$f":"[1]LETs!L6","v":0},{"$f":"[1]LETs!M6","v":0},{"$f":"[1]LETs!N6","v":0},{"$f":"[1]LETs!O6","v":0},{"$f":"[1]LETs!P6","v":0},{"$f":"[1]LETs!Q6","v":0},{"$f":"[1]LETs!R6","v":0},{"$f":"IF(MONTH(S$2)=1,$G6,IF(MONTH(S$2)=2,$H6,IF(MONTH(S$2)=3,$I6,IF(MONTH(S$2)=4,$J6,IF(MONTH(S$2)=5,$K6,IF(MONTH(S$2)=6,$L6,IF(MONTH(S$2)=7,$M6,IF(MONTH(S$2)=8,$N6,IF(MONTH(S$2)=9,$O6,IF(MONTH(S$2)=10,$P6,IF(MONTH(S$2)=11,$Q6,$R6)))))))))))","v":0.98},null,null,"De:","Rodolfo Miranda Mascagni <rmmascagni@submarino.com.br>; BRRJDL.QUALIDADE-SEROPEDICA <qualidade.seropedica@b2wdigital.com>; Robson Silva de Souza <robson.souza@b2wdigital.com>"]
[null,"CD","Produtividade CD","Produtividade CD",{"$f":"[1]LETs!E7","v":2},{"$f":"[1]LETs!F7","v":32.229999999999997},{"$f":"[1]LETs!G7","v":31.3},{"$f":"[1]LETs!H7","v":35},{"$f":"[1]LETs!I7","v":0},{"$f":"[1]LETs!J7","v":0},{"$f":"[1]LETs!K7","v":0},{"$f":"[1]LETs!L7","v":0},{"$f":"[1]LETs!M7","v":0},{"$f":"[1]LETs!N7","v":0},{"$f":"[1]LETs!O7","v":0},{"$f":"[1]LETs!P7","v":0},{"$f":"[1]LETs!Q7","v":0},{"$f":"[1]LETs!R7","v":0},{"$f":"IFERROR(INDEX([1]LETs!$F$3:$AZZ$214,MATCH($D7,[1]LETs!$D$3:$D$214,0),MATCH($S$2,[1]LETs!$F$2:$AZZ$2,0)),0)","v":44.25},null,null,"Assunto:",{"$f":"CONCATENATE(\"Super Copa & Copa dos Campeões - \"&TEXT(S2,\"DD/MM/AAAA\"))","v":"Super Copa & Copa dos Campeões - 10/02/2021"}]
[null,null,null,"Quadro Produtivo Total",null,{"$f":"[1]LETs!F8","v":11383},{"$f":"[1]LETs!G8","v":8523},{"$f":"[1]LETs!H8","v":2860},{"$f":"[1]LETs!I8","v":0},{"$f":"[1]LETs!J8","v":0},{"$f":"[1]LETs!K8","v":0},{"$f":"[1]LETs!L8","v":0},{"$f":"[1]LETs!M8","v":0},{"$f":"[1]LETs!N8","v":0},{"$f":"[1]LETs!O8","v":0},{"$f":"[1]LETs!P8","v":0},{"$f":"[1]LETs!Q8","v":0},{"$f":"[1]LETs!R8","v":0},{"$f":"IFERROR(INDEX([1]LETs!$F$3:$AZZ$214,MATCH($D8,[1]LETs!$D$3:$D$214,0),MATCH($S$2,[1]LETs!$F$2:$AZZ$2,0)),0)","v":313}]
[null,null,null,"QP Terceiros",null,{"$f":"[1]LETs!F9","v":0},{"$f":"[1]LETs!G9","v":0},{"$f":"[1]LETs!H9","v":0},{"$f":"[1]LETs!I9","v":0},{"$f":"[1]LETs!J9","v":0},{"$f":"[1]LETs!K9","v":0},{"$f":"[1]LETs!L9","v":0},{"$f":"[1]LETs!M9","v":0},{"$f":"[1]LETs!N9","v":0},{"$f":"[1]LETs!O9","v":0},{"$f":"[1]LETs!P9","v":0},{"$f":"[1]LETs!Q9","v":0},{"$f":"[1]LETs!R9","v":0},{"$f":"IFERROR(INDEX([1]LETs!$F$3:$AZZ$214,MATCH($D9,[1]LETs!$D$3:$D$214,0),MATCH($S$2,[1]LETs!$F$2:$AZZ$2,0)),0)","v":0}]
[null,null,null,"Faturamento",null,{"$f":"[1]LETs!F10","v":366850},{"$f":"[1]LETs!G10","v":266743},{"$f":"[1]LETs!H10","v":100107},{"$f":"[1]LETs!I10","v":0},{"$f":"[1]LETs!J10","v":0},{"$f":"[1]LETs!K10","v":0},{"$f":"[1]LETs!L10","v":0},{"$f":"[1]LETs!M10","v":0},{"$f":"[1]LETs!N10","v":0},{"$f":"[1]LETs!O10","v":0},{"$f":"[1]LETs!P10","v":0},{"$f":"[1]LETs!Q10","v":0},{"$f":"[1]LETs!R10","v":0},{"$f":"IFERROR(INDEX([1]LETs!$F$3:$AZZ$214,MATCH($D10,[1]LETs!$D$3:$D$214,0),MATCH($S$2,[1]LETs!$F$2:$AZZ$2,0)),0)","v":13851}]
[null,null,null,"Meta",null,{"$f":"[1]LETs!F11","v":41.168280000000003},{"$f":"[1]LETs!G11","v":43.605073326068187},{"$f":"[1]LETs!H11","v":33.906472627338935},{"$f":"[1]LETs!I11","v":0},{"$f":"[1]LETs!J11","v":0},{"$f":"[1]LETs!K11","v":0},{"$f":"[1]LETs!L11","v":0},{"$f":"[1]LETs!M11","v":0},{"$f":"[1]LETs!N11","v":0},{"$f":"[1]LETs!O11","v":0},{"$f":"[1]LETs!P11","v":0},{"$f":"[1]LETs!Q11","v":0},{"$f":"[1]LETs!R11","v":0},{"$f":"IF(MONTH(S$2)=1,$G11,IF(MONTH(S$2)=2,$H11,IF(MONTH(S$2)=3,$I11,IF(MONTH(S$2)=4,$J11,IF(MONTH(S$2)=5,$K11,IF(MONTH(S$2)=6,$L11,IF(MONTH(S$2)=7,$M11,IF(MONTH(S$2)=8,$N11,IF(MONTH(S$2)=9,$O11,IF(MONTH(S$2)=10,$P11,IF(MONTH(S$2)=11,$Q11,$R11)))))))))))","v":33.906472627338935},null,null,"Corpo do e-mail:",{"$f":"IF(X39<=X40,W40,IF(X39<=X41,W41,W42))","v":"Bom Dia,"}]
[null,null,"Acidentes (Típicos + Trajeto)","Acidentes",{"$f":"[1]LETs!E12","v":"-0,50\nP"},{"$f":"[1]LETs!F12","v":0},{"$f":"[1]LETs!G12","v":0},{"$f":"[1]LETs!H12","v":0},{"$f":"[1]LETs!I12","v":0},{"$f":"[1]LETs!J12","v":0},{"$f":"[1]LETs!K12","v":0},{"$f":"[1]LETs!L12","v":0},{"$f":"[1]LETs!M12","v":0},{"$f":"[1]LETs!N12","v":0},{"$f":"[1]LETs!O12","v":0},{"$f":"[1]LETs!P12","v":0},{"$f":"[1]LETs!Q12","v":0},{"$f":"[1]LETs!R12","v":0},{"$f":"IFERROR(INDEX([1]LETs!$F$3:$AZZ$214,MATCH($D12,[1]LETs!$D$3:$D$214,0),MATCH($S$2,[1]LETs!$F$2:$AZZ$2,0)),0)","v":0},null,null,null,"Segue abaixo SuperCopa e Copa dos Campeões:"]
[null,null,null,"Meta",null,{"$f":"[1]LETs!F13","v":0},{"$f":"[1]LETs!G13","v":0},{"$f":"[1]LETs!H13","v":0},{"$f":"[1]LETs!I13","v":0},{"$f":"[1]LETs!J13","v":0},{"$f":"[1]LETs!K13","v":0},{"$f":"[1]LETs!L13","v":0},{"$f":"[1]LETs!M13","v":0},{"$f":"[1]LETs!N13","v":0},{"$f":"[1]LETs!O13","v":0},{"$f":"[1]LETs!P13","v":0},{"$f":"[1]LETs!Q13","v":0},{"$f":"[1]LETs!R13","v":0},{"$f":"IF(MONTH(S$2)=1,$G13,IF(MONTH(S$2)=2,$H13,IF(MONTH(S$2)=3,$I13,IF(MONTH(S$2)=4,$J13,IF(MONTH(S$2)=5,$K13,IF(MONTH(S$2)=6,$L13,IF(MONTH(S$2)=7,$M13,IF(MONTH(S$2)=8,$N13,IF(MONTH(S$2)=9,$O13,IF(MONTH(S$2)=10,$P13,IF(MONTH(S$2)=11,$Q13,$R13)))))))))))","v":0},null,null,"A base atualizada encontra-se em: ","\\\\fsb2w03\\CD-Seropedica\\00.Novo GEROT\\0.2- Copa dos Campeões"]
[null,null,"Anomalias","Anomalias",{"$f":"[1]LETs!E14","v":"-0,50\nP"},{"$f":"[1]LETs!F14","v":0},{"$f":"[1]LETs!G14","v":0},{"$f":"[1]LETs!H14","v":0},{"$f":"[1]LETs!I14","v":0},{"$f":"[1]LETs!J14","v":0},{"$f":"[1]LETs!K14","v":0},{"$f":"[1]LETs!L14","v":0},{"$f":"[1]LETs!M14","v":0},{"$f":"[1]LETs!N14","v":0},{"$f":"[1]LETs!O14","v":0},{"$f":"[1]LETs!P14","v":0},{"$f":"[1]LETs!Q14","v":0},{"$f":"[1]LETs!R14","v":0},{"$f":"IFERROR(INDEX([1]LETs!$F$3:$AZZ$214,MATCH($D14,[1]LETs!$D$3:$D$214,0),MATCH($S$2,[1]LETs!$F$2:$AZZ$2,0)),0)","v":0},null,null,"Seguem links (PowerBI):"]
[null,null,null,"Meta",null,{"$f":"[1]LETs!F15","v":0},{"$f":"[1]LETs!G15","v":0},{"$f":"[1]LETs!H15","v":0},{"$f":"[1]LETs!I15","v":0},{"$f":"[1]LETs!J15","v":0},{"$f":"[1]LETs!K15","v":0},{"$f":"[1]LETs!L15","v":0},{"$f":"[1]LETs!M15","v":0},{"$f":"[1]LETs!N15","v":0},{"$f":"[1]LETs!O15","v":0},{"$f":"[1]LETs!P15","v":0},{"$f":"[1]LETs!Q15","v":0},{"$f":"[1]LETs!R15","v":0},{"$f":"IF(MONTH(S$2)=1,$G15,IF(MONTH(S$2)=2,$H15,IF(MONTH(S$2)=3,$I15,IF(MONTH(S$2)=4,$J15,IF(MONTH(S$2)=5,$K15,IF(MONTH(S$2)=6,$L15,IF(MONTH(S$2)=7,$M15,IF(MONTH(S$2)=8,$N15,IF(MONTH(S$2)=9,$O15,IF(MONTH(S$2)=10,$P15,IF(MONTH(S$2)=11,$Q15,$R15)))))))))))","v":0},null,null,"• Gerot: ","https://app.powerbi.com/groups/me/apps/affa335c-f89f-4d19-b1c1-935bc83b2eee/reports/c941564f-1662-481f-867a-55d748522c71/ReportSection?ctid=809e2f09-760f-4d6e-835a-d3b3e8251285"]
[null,"Estoque","Perda Operacional","Total de Perda Operacional",{"$f":"[1]LETs!E16","v":0.5},{"$f":"[1]LETs!F16","v":166.11788491080023},{"$f":"[1]LETs!G16","v":158.66377913420351},{"$f":"[1]LETs!H16","v":7.4541057765967258},{"$f":"[1]LETs!I16","v":0},{"$f":"[1]LETs!J16","v":0},{"$f":"[1]LETs!K16","v":0},{"$f":"[1]LETs!L16","v":0},{"$f":"[1]LETs!M16","v":0},{"$f":"[1]LETs!N16","v":0},{"$f":"[1]LETs!O16","v":0},{"$f":"[1]LETs!P16","v":0},{"$f":"[1]LETs!Q16","v":0},{"$f":"[1]LETs!R16","v":0},{"$f":"IFERROR(INDEX([1]LETs!$F$3:$AZZ$214,MATCH($D16,[1]LETs!$D$3:$D$214,0),MATCH($S$2,[1]LETs!$F$2:$AZZ$2,0)),0)","v":0},null,null,"• OBZ: ","https://app.powerbi.com/groups/me/apps/affa335c-f89f-4d19-b1c1-935bc83b2eee/reports/b380faef-cf63-4657-9b15-3797b44da25c/ReportSection?ctid=809e2f09-760f-4d6e-835a-d3b3e8251285"]
[null,null,null,"Avarias",null,{"$f":"[1]LETs!F17","v":147.80076648000176},{"$f":"[1]LETs!G17","v":147.25956228976167},{"$f":"[1]LETs!H17","v":0.54120419024006994},{"$f":"[1]LETs!I17","v":0},{"$f":"[1]LETs!J17","v":0},{"$f":"[1]LETs!K17","v":0},{"$f":"[1]LETs!L17","v":0},{"$f":"[1]LETs!M17","v":0},{"$f":"[1]LETs!N17","v":0},{"$f":"[1]LETs!O17","v":0},{"$f":"[1]LETs!P17","v":0},{"$f":"[1]LETs!Q17","v":0},{"$f":"[1]LETs!R17","v":0},{"$f":"IFERROR(INDEX([1]LETs!$F$3:$AZZ$214,MATCH($D17,[1]LETs!$D$3:$D$214,0),MATCH($S$2,[1]LETs!$F$2:$AZZ$2,0)),0)","v":0},null,null,"• Gerot:"]
[null,null,null,"Quebras",null,{"$f":"[1]LETs!F18","v":11.43593136862491},{"$f":"[1]LETs!G18","v":11.404216844441846},{"$f":"[1]LETs!H18","v":3.1714524183064106E-2},{"$f":"[1]LETs!I18","v":0},{"$f":"[1]LETs!J18","v":0},{"$f":"[1]LETs!K18","v":0},{"$f":"[1]LETs!L18","v":0},{"$f":"[1]LETs!M18","v":0},{"$f":"[1]LETs!N18","v":0},{"$f":"[1]LETs!O18","v":0},{"$f":"[1]LETs!P18","v":0},{"$f":"[1]LETs!Q18","v":0},{"$f":"[1]LETs!R18","v":0},{"$f":"IFERROR(INDEX([1]LETs!$F$3:$AZZ$214,MATCH($D18,[1]LETs!$D$3:$D$214,0),MATCH($S$2,[1]LETs!$F$2:$AZZ$2,0)),0)","v":0},null,null,"• Gerot:"]
[null,null,null,"Vencidos",null,{"$f":"[1]LETs!F19","v":0},{"$f":"[1]LETs!G19","v":0},{"$f":"[1]LETs!H19","v":0},{"$f":"[1]LETs!I19","v":0},{"$f":"[1]LETs!J19","v":0},{"$f":"[1]LETs!K19","v":0},{"$f":"[1]LETs!L19","v":0},{"$f":"[1]LETs!M19","v":0},{"$f":"[1]LETs!N19","v":0},{"$f":"[1]LETs!O19","v":0},{"$f":"[1]LETs!P19","v":0},{"$f":"[1]LETs!Q19","v":0},{"$f":"[1]LETs!R19","v":0},{"$f":"IFERROR(INDEX([1]LETs!$F$3:$AZZ$214,MATCH($D19,[1]LETs!$D$3:$D$214,0),MATCH($S$2,[1]LETs!$F$2:$AZZ$2,0)),0)","v":0},null,null,"• Gerot:"]
[null,null,null,"Furtos",null,{"$f":"[1]LETs!F20","v":0},{"$f":"[1]LETs!G20","v":0},{"$f":"[1]LETs!H20","v":0},{"$f":"[1]LETs!I20","v":0},{"$f":"[1]LETs!J20","v":0},{"$f":"[1]LETs!K20","v":0},{"$f":"[1]LETs!L20","v":0},{"$f":"[1]LETs!M20","v":0},{"$f":"[1]LETs!N20","v":0},{"$f":"[1]LETs!O20","v":0},{"$f":"[1]LETs!P20","v":0},{"$f":"[1]LETs!Q20","v":0},{"$f":"[1]LETs!R20","v":0},{"$f":"IFERROR(INDEX([1]LETs!$F$3:$AZZ$214,MATCH($D20,[1]LETs!$D$3:$D$214,0),MATCH($S$2,[1]LETs!$F$2:$AZZ$2,0)),0)","v":0},null,null,"• Gerot:"]
[null,null,null,"Meta",null,{"$f":"[1]LETs!F21","v":50},{"$f":"[1]LETs!G21","v":50},{"$f":"[1]LETs!H21","v":50},{"$f":"[1]LETs!I21","v":0},{"$f":"[1]LETs!J21","v":0},{"$f":"[1]LETs!K21","v":0},{"$f":"[1]LETs!L21","v":0},{"$f":"[1]LETs!M21","v":0},{"$f":"[1]LETs!N21","v":0},{"$f":"[1]LETs!O21","v":0},{"$f":"[1]LETs!P21","v":0},{"$f":"[1]LETs!Q21","v":0},{"$f":"[1]LETs!R21","v":0},{"$f":"IF(MONTH(S$2)=1,$G21,IF(MONTH(S$2)=2,$H21,IF(MONTH(S$2)=3,$I21,IF(MONTH(S$2)=4,$J21,IF(MONTH(S$2)=5,$K21,IF(MONTH(S$2)=6,$L21,IF(MONTH(S$2)=7,$M21,IF(MONTH(S$2)=8,$N21,IF(MONTH(S$2)=9,$O21,IF(MONTH(S$2)=10,$P21,IF(MONTH(S$2)=11,$Q21,$R21)))))))))))","v":50},null,null,"• Reunião de Operações: ","https://app.powerbi.com/groups/me/apps/affa335c-f89f-4d19-b1c1-935bc83b2eee/reports/3084419d-2725-472a-831f-3db122d7f60f/ReportSection84429facd09a70911520?ctid=809e2f09-760f-4d6e-835a-d3b3e8251285"]
[null,null,"Armazenagem no Prazo","Armazenagem no Prazo",{"$f":"[1]LETs!E22","v":0.5},{"$f":"[1]LETs!F22","v":0.99960000000000004},{"$f":"[1]LETs!G22","v":0.99939999999999996},{"$f":"[1]LETs!H22","v":1},{"$f":"[1]LETs!I22","v":0},{"$f":"[1]LETs!J22","v":0},{"$f":"[1]LETs!K22","v":0},{"$f":"[1]LETs!L22","v":0},{"$f":"[1]LETs!M22","v":0},{"$f":"[1]LETs!N22","v":0},{"$f":"[1]LETs!O22","v":0},{"$f":"[1]LETs!P22","v":0},{"$f":"[1]LETs!Q22","v":0},{"$f":"[1]LETs!R22","v":0},{"$f":"IFERROR(INDEX([1]LETs!$F$3:$AZZ$214,MATCH($D22,[1]LETs!$D$3:$D$214,0),MATCH($S$2,[1]LETs!$F$2:$AZZ$2,0)),0)","v":1}]
[null,null,null,"Prazo (ARM)",null,{"$f":"[1]LETs!F23","v":451888},{"$f":"[1]LETs!G23","v":329917},{"$f":"[1]LETs!H23","v":121971},{"$f":"[1]LETs!I23","v":0},{"$f":"[1]LETs!J23","v":0},{"$f":"[1]LETs!K23","v":0},{"$f":"[1]LETs!L23","v":0},{"$f":"[1]LETs!M23","v":0},{"$f":"[1]LETs!N23","v":0},{"$f":"[1]LETs!O23","v":0},{"$f":"[1]LETs!P23","v":0},{"$f":"[1]LETs!Q23","v":0},{"$f":"[1]LETs!R23","v":0},{"$f":"IFERROR(INDEX([1]LETs!$F$3:$AZZ$214,MATCH($D23,[1]LETs!$D$3:$D$214,0),MATCH($S$2,[1]LETs!$F$2:$AZZ$2,0)),0)","v":9394}]
[null,null,null,"Atraso (ARM)",null,{"$f":"[1]LETs!F24","v":192},{"$f":"[1]LETs!G24","v":192},{"$f":"[1]LETs!H24","v":0},{"$f":"[1]LETs!I24","v":0},{"$f":"[1]LETs!J24","v":0},{"$f":"[1]LETs!K24","v":0},{"$f":"[1]LETs!L24","v":0},{"$f":"[1]LETs!M24","v":0},{"$f":"[1]LETs!N24","v":0},{"$f":"[1]LETs!O24","v":0},{"$f":"[1]LETs!P24","v":0},{"$f":"[1]LETs!Q24","v":0},{"$f":"[1]LETs!R24","v":0},{"$f":"IFERROR(INDEX([1]LETs!$F$3:$AZZ$214,MATCH($D24,[1]LETs!$D$3:$D$214,0),MATCH($S$2,[1]LETs!$F$2:$AZZ$2,0)),0)","v":0}]
[null,null,null,"Meta",null,{"$f":"[1]LETs!F25","v":0.99980000000000002},{"$f":"[1]LETs!G25","v":0.99980000000000002},{"$f":"[1]LETs!H25","v":0.99980000000000002},{"$f":"[1]LETs!I25","v":0},{"$f":"[1]LETs!J25","v":0},{"$f":"[1]LETs!K25","v":0},{"$f":"[1]LETs!L25","v":0},{"$f":"[1]LETs!M25","v":0},{"$f":"[1]LETs!N25","v":0},{"$f":"[1]LETs!O25","v":0},{"$f":"[1]LETs!P25","v":0},{"$f":"[1]LETs!Q25","v":0},{"$f":"[1]LETs!R25","v":0},{"$f":"IF(MONTH(S$2)=1,$G25,IF(MONTH(S$2)=2,$H25,IF(MONTH(S$2)=3,$I25,IF(MONTH(S$2)=4,$J25,IF(MONTH(S$2)=5,$K25,IF(MONTH(S$2)=6,$L25,IF(MONTH(S$2)=7,$M25,IF(MONTH(S$2)=8,$N25,IF(MONTH(S$2)=9,$O25,IF(MONTH(S$2)=10,$P25,IF(MONTH(S$2)=11,$Q25,$R25)))))))))))","v":0.99980000000000002}]
[null,null,"Estoque Virtual","Estoque Virtual",{"$f":"[1]LETs!E26","v":1},{"$f":"[1]LETs!F26","v":277.6814491020433},{"$f":"[1]LETs!G26","v":6278.7264810440092},{"$f":"[1]LETs!H26","v":277.6814491020433},{"$f":"[1]LETs!I26","v":0},{"$f":"[1]LETs!J26","v":0},{"$f":"[1]LETs!K26","v":0},{"$f":"[1]LETs!L26","v":0},{"$f":"[1]LETs!M26","v":0},{"$f":"[1]LETs!N26","v":0},{"$f":"[1]LETs!O26","v":0},{"$f":"[1]LETs!P26","v":0},{"$f":"[1]LETs!Q26","v":0},{"$f":"[1]LETs!R26","v":0},{"$f":"IFERROR(INDEX([1]LETs!$F$3:$AZZ$214,MATCH($D26,[1]LETs!$D$3:$D$214,0),MATCH($S$2,[1]LETs!$F$2:$AZZ$2,0)),0)","v":277.6814491020433}]
[null,null,null,"Expedidos $",null,{"$f":"[1]LETs!F27","v":4922035061.8836994},{"$f":"[1]LETs!G27","v":378305068.98004818},{"$f":"[1]LETs!H27","v":4922035061.8836994},{"$f":"[1]LETs!I27","v":0},{"$f":"[1]LETs!J27","v":0},{"$f":"[1]LETs!K27","v":0},{"$f":"[1]LETs!L27","v":0},{"$f":"[1]LETs!M27","v":0},{"$f":"[1]LETs!N27","v":0},{"$f":"[1]LETs!O27","v":0},{"$f":"[1]LETs!P27","v":0},{"$f":"[1]LETs!Q27","v":0},{"$f":"[1]LETs!R27","v":0},{"$f":"IFERROR(INDEX([1]LETs!$F$3:$AZZ$214,MATCH($D27,[1]LETs!$D$3:$D$214,0),MATCH($S$2,[1]LETs!$F$2:$AZZ$2,0)),0)","v":485331360.21799999}]
[null,null,null,"Meta",null,{"$f":"[1]LETs!F28","v":265.79336999999998},{"$f":"[1]LETs!G28","v":1382.03},{"$f":"[1]LETs!H28","v":180},{"$f":"[1]LETs!I28","v":0},{"$f":"[1]LETs!J28","v":0},{"$f":"[1]LETs!K28","v":0},{"$f":"[1]LETs!L28","v":0},{"$f":"[1]LETs!M28","v":0},{"$f":"[1]LETs!N28","v":0},{"$f":"[1]LETs!O28","v":0},{"$f":"[1]LETs!P28","v":0},{"$f":"[1]LETs!Q28","v":0},{"$f":"[1]LETs!R28","v":0},{"$f":"IF(MONTH(S$2)=1,$G28,IF(MONTH(S$2)=2,$H28,IF(MONTH(S$2)=3,$I28,IF(MONTH(S$2)=4,$J28,IF(MONTH(S$2)=5,$K28,IF(MONTH(S$2)=6,$L28,IF(MONTH(S$2)=7,$M28,IF(MONTH(S$2)=8,$N28,IF(MONTH(S$2)=9,$O28,IF(MONTH(S$2)=10,$P28,IF(MONTH(S$2)=11,$Q28,$R28)))))))))))","v":180}]
[null,"CD","Absenteísmo","Absenteísmo",{"$f":"[1]LETs!E29","v":1},{"$f":"[1]LETs!F29","v":2.1100000000000001E-2},{"$f":"[1]LETs!G29","v":2.1499999999999998E-2},{"$f":"[1]LETs!H29","v":0.02},{"$f":"[1]LETs!I29","v":0},{"$f":"[1]LETs!J29","v":0},{"$f":"[1]LETs!K29","v":0},{"$f":"[1]LETs!L29","v":0},{"$f":"[1]LETs!M29","v":0},{"$f":"[1]LETs!N29","v":0},{"$f":"[1]LETs!O29","v":0},{"$f":"[1]LETs!P29","v":0},{"$f":"[1]LETs!Q29","v":0},{"$f":"[1]LETs!R29","v":0},{"$f":"IFERROR(INDEX([1]LETs!$F$3:$AZZ$214,MATCH($D29,[1]LETs!$D$3:$D$214,0),MATCH($S$2,[1]LETs!$F$2:$AZZ$2,0)),0)","v":1.3899999999999999E-2},null,null,null,"Última entrega:",{"$f":"NOW()","v":44238.435843171297}]
[null,null,null,"Quadro Líquido",null,{"$f":"[1]LETs!F30","v":12404},{"$f":"[1]LETs!G30","v":9196},{"$f":"[1]LETs!H30","v":3208},{"$f":"[1]LETs!I30","v":0},{"$f":"[1]LETs!J30","v":0},{"$f":"[1]LETs!K30","v":0},{"$f":"[1]LETs!L30","v":0},{"$f":"[1]LETs!M30","v":0},{"$f":"[1]LETs!N30","v":0},{"$f":"[1]LETs!O30","v":0},{"$f":"[1]LETs!P30","v":0},{"$f":"[1]LETs!Q30","v":0},{"$f":"[1]LETs!R30","v":0},{"$f":"IFERROR(INDEX([1]LETs!$F$3:$AZZ$214,MATCH($D30,[1]LETs!$D$3:$D$214,0),MATCH($S$2,[1]LETs!$F$2:$AZZ$2,0)),0)","v":360},null,null,null,null,{"$f":"TODAY()","v":44238}]
{"$rows_left_out":185}
{"sheet":"Metas","index":1,"n_rows":303,"n_cols":16,"rows_kept":303,"cut":false,"hidden":false,"merged":[]}
["Performance - SEC","Jan/21","Fev/21","Mar/21","Abr/21","Mai/21","Jun/21","Jul/21","Ago/21","Set/21","Out/21","Nov/21","Dez/21",2021]
["CD",0.98,0.98,null,null,null,null,null,null,null,null,null,null,{"$f":"IFERROR(ROUND(SUMPRODUCT(B2:M2,B3:M3)/N3,4),B2)","v":0.98}]
["Total SEC",{"$f":"IFERROR(SUMIFS([1]Base!$F:$F,[1]Base!$A:$A,\">=\"&DATE(YEAR(B$1),MONTH(B$1),1),[1]Base!$A:$A,\"<=\"&EOMONTH(B$1,0),[1]Base!$C:$C,$A2),0)+IFERROR(SUMIFS([1]Base!$E:$E,[1]Base!$A:$A,\">=\"&DATE(YEAR(B$1),MONTH(B$1),1),[1]Base!$A:$A,\"<=\"&EOMONTH(B$1,0),[1]Base!$C:$C,$A2),0)","v":0},{"$f":"IFERROR(SUMIFS([1]Base!$F:$F,[1]Base!$A:$A,\">=\"&DATE(YEAR(C$1),MONTH(C$1),1),[1]Base!$A:$A,\"<=\"&EOMONTH(C$1,0),[1]Base!$C:$C,$A2),0)+IFERROR(SUMIFS([1]Base!$E:$E,[1]Base!$A:$A,\">=\"&DATE(YEAR(C$1),MONTH(C$1),1),[1]Base!$A:$A,\"<=\"&EOMONTH(C$1,0),[1]Base!$C:$C,$A2),0)","v":0},null,null,null,null,null,null,null,null,null,null,{"$f":"SUM(B3:M3)","v":0}]
["Inbound","-","-"]
["-","-","-"]
["Estoque","-","-"]
["-","-","-"]
["Outbound",{"$f":"$B$2","v":0.98},{"$f":"$B$2","v":0.98},null,null,null,null,null,null,null,null,null,null,{"$f":"N2","v":0.98}]
["Total SEC",{"$f":"B3","v":0},{"$f":"C3","v":0},null,null,null,null,null,null,null,null,null,null,{"$f":"N3","v":0}]
[]
["Reclamações de Clientes",{"$f":"B$1","v":"Jan/21"},{"$f":"C$1","v":"Fev/21"},{"$f":"D$1","v":"Mar/21"},"Abr/21","Mai/21","Jun/21","Jul/21","Ago/21","Set/21","Out/21","Nov/21","Dez/21",2021]
["CD",1.9000000000000001E-5,1.9000000000000001E-5,null,null,null,null,null,null,null,null,null,null,{"$f":"IFERROR(ROUND(SUMPRODUCT(B12:M12,B13:M13)/N13,5),B12)","v":1.9000000000000001E-5}]
["Expedidos",{"$f":"IFERROR(SUMIFS([1]Base!$AP:$AP,[1]Base!$A:$A,\">=\"&DATE(YEAR(B$1),MONTH(B$1),1),[1]Base!$A:$A,\"<=\"&EOMONTH(B$1,0),[1]Base!$C:$C,$A12),0)","v":0},{"$f":"IFERROR(SUMIFS([1]Base!$AP:$AP,[1]Base!$A:$A,\">=\"&DATE(YEAR(C$1),MONTH(C$1),1),[1]Base!$A:$A,\"<=\"&EOMONTH(C$1,0),[1]Base!$C:$C,$A12),0)","v":0},null,null,null,null,null,null,null,null,null,null,{"$f":"SUM(B13:M13)","v":0}]
["Inbound","-","-"]
["-","-","-"]
["Estoque","-","-"]
["-","-","-"]
["Outbound",{"$f":"B12","v":1.9000000000000001E-5},{"$f":"C12","v":1.9000000000000001E-5},null,null,null,null,null,null,null,null,null,null,{"$f":"N12","v":1.9000000000000001E-5}]
["Expedidos",{"$f":"B13","v":0},{"$f":"C13","v":0},null,null,null,null,null,null,null,null,null,null,{"$f":"N13","v":0}]
[]
["Perda Operacional",{"$f":"B$1","v":"Jan/21"},{"$f":"C$1","v":"Fev/21"},{"$f":"D$1","v":"Mar/21"},"Abr/21","Mai/21","Jun/21","Jul/21","Ago/21","Set/21","Out/21","Nov/21","Dez/21",2021]
["CD",50,50,null,null,null,null,null,null,null,null,null,null,{"$f":"IFERROR(ROUND(SUMPRODUCT(B22:M22,B23:M23)/N23,5),B22)","v":50}]
["Qtd. Dias",{"$f":"DAY(EOMONTH(B$1,0))","v":31},{"$f":"DAY(EOMONTH(C$1,0))","v":28},null,null,null,null,null,null,null,null,null,null,{"$f":"SUM(B23:M23)","v":59}]
["Inbound","-","-"]
["Qtd. Dias","-","-"]
["Estoque",{"$f":"B22","v":50},{"$f":"C22","v":50},null,null,null,null,null,null,null,null,null,null,{"$f":"N22","v":50}]
["Qtd. Dias",{"$f":"B23","v":31},{"$f":"C23","v":28},null,null,null,null,null,null,null,null,null,null,59]
["Outbound","-","-"]
["-","-","-"]
[]
{"$rows_left_out":273}